Target
Glutamate receptor ionotropic, kainate 5
Ligand
BDBM50060633
Substrate
Meas. Tech.
ChEMBL_90444 (CHEMBL698076)
Ki
1150±n/a nM
Citation
 Jane, DEHoo, KKamboj, RDeverill, MBleakman, DMandelzys, A Synthesis of willardiine and 6-azawillardiine analogs: pharmacological characterization on cloned homomeric human AMPA and kainate receptor subtypes. J Med Chem 40:3645-50 (1997)  
Target
Name:
Glutamate receptor ionotropic, kainate 5
Synonyms:
GRIK2 GRIK5_HUMAN Glutamate receptor, ionotropic kainate 5 Ionotropic glutamate receptor kainate 2/5
Type:
Enzyme Catalytic Domain
Mol. Mass.:
109280.81
Organism:
Homo sapiens (Human)
Description:
Glutamate-Kainate 5 Grik5 HUMAN::Q16478
Residue:
980
  
Inhibitor
Name:
BDBM50060633
Synonyms:
(S)-2-Amino-3-(6-methyl-3,5-dioxo-4,5-dihydro-3H-[1,2,4]triazin-2-yl)-propionic acid | CHEMBL120808
Type:
Small organic molecule
Emp. Form.:
C7H10N4O4
Mol. Mass.:
214.1787
SMILES:
Cc1nn(C[C@H](N)C(O)=O)c(=O)[nH]c1=O
: