Target
5-hydroxytryptamine receptor 2C
Ligand
BDBM10755
Substrate
Meas. Tech.
ChEMBL_2808 (CHEMBL617838)
IC50
42±n/a nM
Citation
 Campiani, GCappelli, ANacci, VAnzini, MVomero, SHamon, MCagnotto, AFracasso, CUboldi, CCaccia, SConsolo, SMennini, T Novel and highly potent 5-HT3 receptor agonists based on a pyrroloquinoxaline structure. J Med Chem 40:3670-8 (1997)  
Target
Name:
5-hydroxytryptamine receptor 2C
Synonyms:
5-HT2C 5-hydroxytryptamine receptor 2C (5HT2c) 5ht1c Htr2c Serotonin receptor 2a and 2c (5HT2A and 5HT2C)
Type:
Enzyme
Mol. Mass.:
51935.10
Organism:
Rattus norvegicus (Rat)
Description:
P08909
Residue:
460
  
Inhibitor
Name:
BDBM10755
Synonyms:
14C-5-hydroxy tryptamine creatinine disulfate 5-HT 5-hydroxy tryptamine creatinine disulfate Serotonin | [3H]-5-HT
Type:
Small organic molecule
Emp. Form.:
C10H12N2O
Mol. Mass.:
176.2151
SMILES:
NCCc1c[nH]c2ccc(O)cc12
: