Target
Neuronal acetylcholine receptor subunit alpha-3/beta-4
Ligand
BDBM82070
Substrate
Meas. Tech.
ChEMBL_142599 (CHEMBL750565)
EC50
21000±n/a nM
Citation
 Holladay, MWDart, MJLynch, JK Neuronal nicotinic acetylcholine receptors as targets for drug discovery. J Med Chem 40:4169-94 (1998)  
Target
Name:
Neuronal acetylcholine receptor subunit alpha-3/beta-4
Synonyms:
Neuronal acetylcholine receptor protein alpha-3/beta-4 subunit | Neuronal acetylcholine receptor; alpha3/beta4
Type:
Mol. Mass.:
Description:
ASSAY_ID of ChEMBL is 1970247
Components:
This complex has 2 components.
Component 1
Name:
Neuronal acetylcholine receptor subunit beta-4
Synonyms:
ACHB4_HUMAN Cholinergic, Nicotinic Alpha6Beta3Beta4Alpha5 Nicotinic acetylcholine receptor alpha6/alpha3/beta4
Type:
Enzyme Catalytic Domain
Mol. Mass.:
56388.51
Organism:
Homo sapiens (Human)
Description:
Cholinergic, Nicotinic Alpha6Beta3Beta4Alpha5 0 HUMAN::P30926
Residue:
498
  
Component 2
Name:
Neuronal acetylcholine receptor subunit alpha-3
Synonyms:
ACHA3_HUMAN Cholinergic, Nicotinic Alpha3Beta2 Cholinergic, Nicotinic Alpha3Beta4x NACHRA3 Neuronal acetylcholine receptor subunit alpha-3 nicotinic central
Type:
Enzyme Catalytic Domain
Mol. Mass.:
57479.03
Organism:
Homo sapiens (Human)
Description:
Cholinergic, Nicotinic Alpha3Beta2 0 HUMAN::P32297
Residue:
505
  
Inhibitor
Name:
BDBM82070
Synonyms:
CAS_29790-52-1 Nicotine-D salicylate US9303017, Nicotine
Type:
Emp. Form.:
C10H14N2
Mol. Mass.:
162.2316
SMILES:
CN1CCC[C@H]1c1cccnc1
: