Target
D(2) dopamine receptor
Ligand
BDBM50061661
Substrate
Meas. Tech.
ChEMBL_62884 (CHEMBL673594)
Ki
0.400000±n/a nM
Citation
 Mewshaw, REKavanagh, JStack, GMarquis, KLShi, XKagan, MZWebb, MBKatz, AHPark, AKang, YHAbou-Gharbia, MScerni, RWasik, TCortes-Burgos, LSpangler, TBrennan, JAPiesla, MMazandarani, HCockett, MIOchalski, RCoupet, JAndree, TH New generation dopaminergic agents. 1. Discovery of a novel scaffold which embraces the D2 agonist pharmacophore. Structure-activity relationships of a series of 2-(aminomethyl)chromans. J Med Chem 40:4235-56 (1998)  
Target
Name:
D(2) dopamine receptor
Synonyms:
DOPAMINE D2 DOPAMINE D2 Short Dopamine D2 receptor Drd2
Type:
G Protein-Coupled Receptor (GPCR)
Mol. Mass.:
50931.60
Organism:
Rattus norvegicus (rat)
Description:
P61169
Residue:
444
  
Inhibitor
Name:
BDBM50061661
Synonyms:
2-[(3-Phenyl-propylamino)-methyl]-chroman-7-ol; oxalic acid | CHEMBL135495
Type:
Small organic molecule
Emp. Form.:
C19H23NO2
Mol. Mass.:
297.3914
SMILES:
Oc1ccc2CCC(CNCCCc3ccccc3)Oc2c1
: