Target
5-hydroxytryptamine receptor 1B
Ligand
BDBM50019443
Substrate
Meas. Tech.
ChEMBL_1354 (CHEMBL616539)
Ki
2600±n/a nM
Citation
 Ismaiel, AMDukat, MLaw, HKamboj, RFan, ELee, DKMazzocco, LBuekschkens, DTeitler, MPierson, MEGlennon, RA 2-(1-Naphthyloxy)ethylamines with enhanced affinity for human 5-HT1D beta (h5-HT1B) serotonin receptors. J Med Chem 40:4415-9 (1998)  
Target
Name:
5-hydroxytryptamine receptor 1B
Synonyms:
5-HT-1B 5-HT1B 5HT1B_HUMAN HTR1DB Serotonin (5-HT) receptor Serotonin Receptor 1B
Type:
G Protein-Coupled Receptor (GPCR)
Mol. Mass.:
43579.17
Organism:
Homo sapiens (Human)
Description:
Receptor binding assays were performed using human clone stably expressed in CHO cells
Residue:
390
  
Inhibitor
Name:
BDBM50019443
Synonyms:
1-(1H-Indol-4-yloxy)-3-isopropylamino-propan-2-ol 1-(1H-Indol-4-yloxy)-3-isopropylamino-propan-2-ol(pindolol) LB-46 PINDOLOL,(-) VISKAZIDE | VISKEN
Type:
Small organic molecule
Emp. Form.:
C14H20N2O2
Mol. Mass.:
248.3208
SMILES:
CC(C)NCC(O)COc1cccc2[nH]ccc12
: