Target
5-hydroxytryptamine receptor 4
Ligand
BDBM50056402
Substrate
Meas. Tech.
ChEMBL_3340 (CHEMBL619040)
Ki
5.5±n/a nM
Citation
 Yang, DSoulier, JLSicsic, SMathé-Allainmat, MBrémont, BCroci, TCardamone, RAureggi, GLanglois, M New esters of 4-amino-5-chloro-2-methoxybenzoic acid as potent agonists and antagonists for 5-HT4 receptors. J Med Chem 40:608-21 (1997)  
Target
Name:
5-hydroxytryptamine receptor 4
Synonyms:
5-HT-4 5-HT4L 5-hydroxytryptamine receptor 4 Htr4 Serotonin 4 (5-HT4) receptor
Type:
Enzyme Catalytic Domain
Mol. Mass.:
46117.31
Organism:
RAT
Description:
5-HT4 HTR4 RAT::Q62758
Residue:
406
  
Inhibitor
Name:
BDBM50056402
Synonyms:
4-Amino-5-chloro-2-methoxy-benzoic acid 2-(3-aza-bicyclo[3.2.2]non-3-yl)-ethyl ester | CHEMBL158147
Type:
Small organic molecule
Emp. Form.:
C18H25ClN2O3
Mol. Mass.:
352.856
SMILES:
COc1cc(N)c(Cl)cc1C(=O)OCCN1CC2CCC(CC2)C1
: