Target
Prothrombin
Ligand
BDBM50056774
Substrate
Meas. Tech.
ChEMBL_208888 (CHEMBL814945)
Ki
0.400000±n/a nM
Citation
 Tucker, TJLumma, WCMulichak, AMChen, ZNaylor-Olsen, AMLewis, SDLucas, RFreidinger, RMKuo, LC Design of highly potent noncovalent thrombin inhibitors that utilize a novel lipophilic binding pocket in the thrombin active site. J Med Chem 40:830-2 (1997)  
Target
Name:
Prothrombin
Synonyms:
Activation peptide fragment 1 Coagulation factor II Prothrombin precursor Thrombin heavy chain | Thrombin light chain
Type:
Protein
Mol. Mass.:
70029.57
Organism:
Homo sapiens (Human)
Description:
P00734
Residue:
622
  
Inhibitor
Name:
BDBM50056774
Synonyms:
(S)-1-((R)-3-Phenyl-2-phenylmethanesulfonylamino-propionyl)-pyrrolidine-2-carboxylic acid (4-amino-cyclohexylmethyl)-amide | CHEMBL352564
Type:
Small organic molecule
Emp. Form.:
C28H38N4O4S
Mol. Mass.:
526.691
SMILES:
NC1CCC(CNC(=O)[C@@H]2CCCN2C(=O)[C@@H](Cc2ccccc2)NS(=O)(=O)Cc2ccccc2)CC1
: