Target
Muscarinic acetylcholine receptor M1
Ligand
BDBM46858
Substrate
Meas. Tech.
ChEMBL_138671 (CHEMBL748968)
Ki
3.3±n/a nM
Citation
 Messer, WSAbuh, YFLiu, YPeriyasamy, SNgur, DOEdgar, MAEl-Assadi, AASbeih, SDunbar, PGRoknich, SRho, TFang, ZOjo, BZhang, HHuzl, JJNagy, PI Synthesis and biological characterization of 1,4,5,6-tetrahydropyrimidine and 2-amino-3,4,5,6-tetrahydropyridine derivatives as selective m1 agonists. J Med Chem 40:1230-46 (1997)  
Target
Name:
Muscarinic acetylcholine receptor M1
Synonyms:
ACM1_MOUSE Cholinergic, muscarinic Chrm1 Muscarinic acetylcholine receptor M1
Type:
Enzyme Catalytic Domain
Mol. Mass.:
51400.50
Organism:
Mus musculus
Description:
Cholinergic, muscarinic 0 0::Q52KQ0
Residue:
460
  
Inhibitor
Name:
BDBM46858
Synonyms:
1-methyl-3,6-dihydro-2H-pyridine-5-carboxylic acid methyl ester;hydrobromide ARECOLINE HYDROBROMIDE SMR000058258 cid_9301 | methyl 1-methyl-3,6-dihydro-2H-pyridine-5-carboxylate;hydrobromide
Type:
Small organic molecule
Emp. Form.:
C8H13NO2
Mol. Mass.:
155.1943
SMILES:
COC(=O)C1=CCCN(C)C1
: