Target
Muscarinic acetylcholine receptor M3
Ligand
BDBM50057395
Substrate
Meas. Tech.
ChEMBL_138834 (CHEMBL753022)
EC50
11000±n/a nM
Citation
 Messer, WSAbuh, YFLiu, YPeriyasamy, SNgur, DOEdgar, MAEl-Assadi, AASbeih, SDunbar, PGRoknich, SRho, TFang, ZOjo, BZhang, HHuzl, JJNagy, PI Synthesis and biological characterization of 1,4,5,6-tetrahydropyrimidine and 2-amino-3,4,5,6-tetrahydropyridine derivatives as selective m1 agonists. J Med Chem 40:1230-46 (1997)  
Target
Name:
Muscarinic acetylcholine receptor M3
Synonyms:
ACM3_MOUSE Chrm3 Muscarinic acetylcholine receptor | Muscarinic acetylcholine receptor M3
Type:
PROTEIN
Mol. Mass.:
66232.94
Organism:
Mus musculus
Description:
ChEMBL_138834
Residue:
589
  
Inhibitor
Name:
BDBM50057395
Synonyms:
5-(3-Methoxymethyl-[1,2,4]oxadiazol-5-yl)-1,4,5,6-tetrahydro-pyrimidine; TFA | CHEMBL22089
Type:
Small organic molecule
Emp. Form.:
C8H12N4O2
Mol. Mass.:
196.2065
SMILES:
COCc1noc(n1)C1CNC=NC1
: