Target
5-hydroxytryptamine receptor 1A
Ligand
BDBM50047471
Substrate
Meas. Tech.
ChEMBL_864 (CHEMBL615920)
IC50
34±n/a nM
Citation
 Yasunaga, TNaito, RKontani, TTsukamoto, SNomura, TYamaguchi, TMase, T N-[2-[(substituted chroman-8-yl)oxy]ethyl]-4-(4-methoxyphenyl)butylamines: synthesis and wide range of antagonism at the human 5-HT1A receptor. J Med Chem 40:1252-7 (1997)  
Target
Name:
5-hydroxytryptamine receptor 1A
Synonyms:
5-HT-1A 5-HT1A 5-hydroxytryptamine receptor 1A (5HT1A) 5ht1a Htr1a Serotonin 1a (5-HT1a) receptor/Adrenergic receptor alpha-1 | Serotonin receptor 1A
Type:
G Protein-Coupled Receptor (GPCR)
Mol. Mass.:
46445.29
Organism:
Rattus norvegicus (rat)
Description:
Binding assays were performed using rat hippocampal membranes.
Residue:
422
  
Inhibitor
Name:
BDBM50047471
Synonyms:
(S)-N-tert-butyl-3-(4-(2-methoxyphenyl)piperazin-1-yl)-2-phenylpropanamide N-tert-Butyl-3-[4-(2-methoxy-phenyl)-piperazin-1-yl]-2-phenyl-propionamide | WAY-100135
Type:
Small organic molecule
Emp. Form.:
C24H33N3O2
Mol. Mass.:
395.5377
SMILES:
COc1ccccc1N1CCN(C[C@@H](C(=O)NC(C)(C)C)c2ccccc2)CC1
: