Target
5-hydroxytryptamine receptor 1A
Ligand
BDBM50057436
Substrate
Meas. Tech.
ChEMBL_1425 (CHEMBL616505)
Ki
0.22±n/a nM
Citation
 Yasunaga, TNaito, RKontani, TTsukamoto, SNomura, TYamaguchi, TMase, T N-[2-[(substituted chroman-8-yl)oxy]ethyl]-4-(4-methoxyphenyl)butylamines: synthesis and wide range of antagonism at the human 5-HT1A receptor. J Med Chem 40:1252-7 (1997)  
Target
Name:
5-hydroxytryptamine receptor 1A
Synonyms:
5-HT-1A 5-HT1A 5-hydroxytryptamine receptor 1A (5HT1A) 5ht1a Htr1a Serotonin 1a (5-HT1a) receptor/Adrenergic receptor alpha-1 | Serotonin receptor 1A
Type:
G Protein-Coupled Receptor (GPCR)
Mol. Mass.:
46445.29
Organism:
Rattus norvegicus (rat)
Description:
Binding assays were performed using rat hippocampal membranes.
Residue:
422
  
Inhibitor
Name:
BDBM50057436
Synonyms:
CHEMBL25213 | [2-(6-Fluoro-chroman-8-yloxy)-ethyl]-[4-(4-methoxy-phenyl)-butyl]-amine
Type:
Small organic molecule
Emp. Form.:
C22H28FNO3
Mol. Mass.:
373.461
SMILES:
COc1ccc(CCCCNCCOc2cc(F)cc3CCCOc23)cc1
: