Target
D(2) dopamine receptor
Ligand
BDBM50057436
Substrate
Meas. Tech.
ChEMBL_62897 (CHEMBL676136)
Ki
0.26±n/a nM
Citation
 Yasunaga, TNaito, RKontani, TTsukamoto, SNomura, TYamaguchi, TMase, T N-[2-[(substituted chroman-8-yl)oxy]ethyl]-4-(4-methoxyphenyl)butylamines: synthesis and wide range of antagonism at the human 5-HT1A receptor. J Med Chem 40:1252-7 (1997)  
Target
Name:
D(2) dopamine receptor
Synonyms:
DOPAMINE D2 DOPAMINE D2 Short Dopamine D2 receptor Drd2
Type:
G Protein-Coupled Receptor (GPCR)
Mol. Mass.:
50931.60
Organism:
Rattus norvegicus (rat)
Description:
P61169
Residue:
444
  
Inhibitor
Name:
BDBM50057436
Synonyms:
CHEMBL25213 | [2-(6-Fluoro-chroman-8-yloxy)-ethyl]-[4-(4-methoxy-phenyl)-butyl]-amine
Type:
Small organic molecule
Emp. Form.:
C22H28FNO3
Mol. Mass.:
373.461
SMILES:
COc1ccc(CCCCNCCOc2cc(F)cc3CCCOc23)cc1
: