Target
Cholecystokinin receptor type A
Ligand
BDBM50449787
Substrate
Meas. Tech.
ChEMBL_50191 (CHEMBL663484)
IC50
4300±n/a nM
Citation
 Trivedi, BKPadia, JKHolmes, ARose, SWright, DSHinton, JPPritchard, MCEden, JMKneen, CWebdale, LSuman-Chauhan, NBoden, PSingh, LField, MJHill, D Second generation"peptoid" CCK-B receptor antagonists: identification and development of N-(adamantyloxycarbonyl)-alpha-methyl-(R)-tryptophan derivative (CI-1015) with an improved pharmacokinetic profile. J Med Chem 41:38-45 (1998)  
Target
Name:
Cholecystokinin receptor type A
Synonyms:
CCKAR_RAT Cholecystokinin peripheral Cholecystokinin receptor type A
Type:
Enzyme Catalytic Domain
Mol. Mass.:
49676.37
Organism:
RAT
Description:
Cholecystokinin central 0 RAT::P30551
Residue:
444
  
Inhibitor
Name:
BDBM50449787
Synonyms:
CHEMBL2062154 | PD-134308
Type:
Small organic molecule
Emp. Form.:
C35H42N4O6
Mol. Mass.:
614.7312
SMILES:
[H][C@@]12C[C@@]3([H])C[C@@]([H])(C1)C(OC(=O)N[C@](C)(Cc1c[nH]c4ccccc14)C(=O)NC[C@H](NC(=O)CCC(O)=O)c1ccccc1)[C@@]([H])(C2)C3
: