Target
Adenosine receptor A1
Ligand
BDBM50118810
Substrate
Meas. Tech.
ChEMBL_29131 (CHEMBL637553)
Ki
0.60±n/a nM
Citation
 Franchetti, PCappellacci, LMarchetti, STrincavelli, LMartini, CMazzoni, MRLucacchini, AGrifantini, M 2'-C-Methyl analogues of selective adenosine receptor agonists: synthesis and binding studies. J Med Chem 41:1708-15 (1998)  
Target
Name:
Adenosine receptor A1
Synonyms:
AA1R_BOVIN ADENOSINE A1 high ADORA1 | Adenosine A1 receptor
Type:
Enzyme Catalytic Domain
Mol. Mass.:
36602.99
Organism:
BOVINE
Description:
ADENOSINE 0 BOVINE::P28190
Residue:
326
  
Inhibitor
Name:
BDBM50118810
Synonyms:
(2R,3S,4R,5R)-2-(hydroxymethyl)-5-(6-((R)-1-phenylpropan-2-ylamino)-9H-purin-9-yl)-tetrahydrofuran-3,4-diol CHEMBL139000 R-N6-(phenylisopropyl)adenosine
Type:
Small organic molecule
Emp. Form.:
C19H23N5O4
Mol. Mass.:
385.417
SMILES:
C[C@H](Cc1ccccc1)Nc1ncnc2n(cnc12)[C@@H]1O[C@H](CO)[C@@H](O)[C@H]1O
: