Target
5-hydroxytryptamine receptor 1A
Ligand
BDBM50064552
Substrate
Meas. Tech.
ChEMBL_1159 (CHEMBL616104)
Ki
3.4±n/a nM
Citation
 Reitz, ABBaxter, EWCodd, EEDavis, CBJordan, ADMaryanoff, BEMaryanoff, CAMcDonnell, MEPowell, ETRenzi, MJSchott, MRScott, MKShank, RPVaught, JL Orally active benzamide antipsychotic agents with affinity for dopamine D2, serotonin 5-HT1A, and adrenergic alpha1 receptors. J Med Chem 41:1997-2009 (1998)  
Target
Name:
5-hydroxytryptamine receptor 1A
Synonyms:
5-HT-1A 5-HT1A 5-hydroxytryptamine receptor 1A (5HT1A) 5ht1a Htr1a Serotonin 1a (5-HT1a) receptor/Adrenergic receptor alpha-1 | Serotonin receptor 1A
Type:
G Protein-Coupled Receptor (GPCR)
Mol. Mass.:
46445.29
Organism:
Rattus norvegicus (rat)
Description:
Binding assays were performed using rat hippocampal membranes.
Residue:
422
  
Inhibitor
Name:
BDBM50064552
Synonyms:
(2,3-Dihydro-indol-1-yl)-{3-[4-(2-isopropoxy-phenyl)-piperazin-1-ylmethyl]-phenyl}-methanone | CHEMBL61440
Type:
Small organic molecule
Emp. Form.:
C29H33N3O2
Mol. Mass.:
455.5912
SMILES:
CC(C)Oc1ccccc1N1CCN(Cc2cccc(c2)C(=O)N2CCc3ccccc23)CC1
: