Target
5-hydroxytryptamine receptor 1A
Ligand
BDBM50001869
Substrate
Meas. Tech.
ChEMBL_1159 (CHEMBL616104)
Ki
3.3±n/a nM
Citation
 Reitz, ABBaxter, EWCodd, EEDavis, CBJordan, ADMaryanoff, BEMaryanoff, CAMcDonnell, MEPowell, ETRenzi, MJSchott, MRScott, MKShank, RPVaught, JL Orally active benzamide antipsychotic agents with affinity for dopamine D2, serotonin 5-HT1A, and adrenergic alpha1 receptors. J Med Chem 41:1997-2009 (1998)  
Target
Name:
5-hydroxytryptamine receptor 1A
Synonyms:
5-HT-1A 5-HT1A 5-hydroxytryptamine receptor 1A (5HT1A) 5ht1a Htr1a Serotonin 1a (5-HT1a) receptor/Adrenergic receptor alpha-1 | Serotonin receptor 1A
Type:
G Protein-Coupled Receptor (GPCR)
Mol. Mass.:
46445.29
Organism:
Rattus norvegicus (rat)
Description:
Binding assays were performed using rat hippocampal membranes.
Residue:
422
  
Inhibitor
Name:
BDBM50001869
Synonyms:
1-{5-[4-(2-Isopropoxy-phenyl)-piperazin-1-ylmethyl]-1-methyl-1H-pyrrol-2-ylmethyl}-piperidin-2-one RWJ-25730
Type:
Small organic molecule
Emp. Form.:
C25H36N4O2
Mol. Mass.:
424.5789
SMILES:
CC(C)Oc1ccccc1N1CCN(Cc2ccc(CN3CCCCC3=O)n2C)CC1
: