Target
D(2) dopamine receptor
Ligand
BDBM50064566
Substrate
Meas. Tech.
ChEMBL_62547 (CHEMBL674060)
Ki
39±n/a nM
Citation
 Reitz, ABBaxter, EWCodd, EEDavis, CBJordan, ADMaryanoff, BEMaryanoff, CAMcDonnell, MEPowell, ETRenzi, MJSchott, MRScott, MKShank, RPVaught, JL Orally active benzamide antipsychotic agents with affinity for dopamine D2, serotonin 5-HT1A, and adrenergic alpha1 receptors. J Med Chem 41:1997-2009 (1998)  
Target
Name:
D(2) dopamine receptor
Synonyms:
DOPAMINE D2 DOPAMINE D2 Short Dopamine D2 receptor Drd2
Type:
G Protein-Coupled Receptor (GPCR)
Mol. Mass.:
50931.60
Organism:
Rattus norvegicus (rat)
Description:
P61169
Residue:
444
  
Inhibitor
Name:
BDBM50064566
Synonyms:
1-{3-[4-(2-Isopropoxy-phenyl)-piperazin-1-ylmethyl]-benzoyl}-piperidin-2-one | CHEMBL279837
Type:
Small organic molecule
Emp. Form.:
C26H33N3O3
Mol. Mass.:
435.5585
SMILES:
CC(C)Oc1ccccc1N1CCN(Cc2cccc(c2)C(=O)N2CCCCC2=O)CC1
: