Target
Somatostatin receptor type 2
Ligand
BDBM50064774
Substrate
Meas. Tech.
ChEMBL_200366 (CHEMBL805714)
Ki
4±n/a nM
Citation
 Yang, LGuo, LPasternak, AMosley, RRohrer, SBirzin, EFoor, FCheng, KSchaeffer, JPatchett, AA Spiro[1H-indene-1,4'-piperidine] derivatives as potent and selective non-peptide human somatostatin receptor subtype 2 (sst2) agonists. J Med Chem 41:2175-9 (1998)  
Target
Name:
Somatostatin receptor type 2
Synonyms:
SOMATOSTATIN SST2 SS-2-R SS2R SSTR2 | Somatostatin receptor type 2 (SSTR2)
Type:
Enzyme
Mol. Mass.:
41344.94
Organism:
Homo sapiens (Human)
Description:
P30874
Residue:
369
  
Inhibitor
Name:
BDBM50064774
Synonyms:
1'N-[1-(3-aminomethylcyclohexylmethylcarbamoyl)-2-(1H-3-indolyl)-(1S)-ethyl]spiro[1H-indene-1,4'-(hexahydropyridine)]-1'-carboxamide | CHEMBL305279
Type:
Small organic molecule
Emp. Form.:
C33H41N5O2
Mol. Mass.:
539.7109
SMILES:
NCC1CCCC(CNC(=O)[C@H](Cc2c[nH]c3ccccc23)NC(=O)N2CCC3(CC2)C=Cc2ccccc32)C1
: