Target
Lysosomal alpha-glucosidase
Ligand
BDBM50065253
Substrate
Meas. Tech.
ChEMBL_34525 (CHEMBL648166)
IC50
100000±n/a nM
Citation
 Asano, NNishida, MKato, AKizu, HMatsui, KShimada, YItoh, TBaba, MWatson, AANash, RJLilley, PMWatkin, DJFleet, GW Homonojirimycin isomers and N-alkylated homonojirimycins: structural and conformational basis of inhibition of glycosidases. J Med Chem 41:2565-71 (1998)  
Target
Name:
Lysosomal alpha-glucosidase
Synonyms:
Acidic alpha-glucosidase LYAG_RAT
Type:
PROTEIN
Mol. Mass.:
106191.24
Organism:
Rattus norvegicus
Description:
ChEMBL_1506157
Residue:
953
  
Inhibitor
Name:
BDBM50065253
Synonyms:
1-Butyl-2,6-bis-hydroxymethyl-piperidine-3,4,5-triol | CHEMBL3084806
Type:
Small organic molecule
Emp. Form.:
C11H23NO5
Mol. Mass.:
249.304
SMILES:
CCCCN1[C@H](CO)[C@@H](O)[C@H](O)[C@@H](O)[C@H]1CO
: