Target
Tissue alpha-L-fucosidase
Ligand
BDBM50408432
Substrate
Meas. Tech.
ChEMBL_34094 (CHEMBL649723)
IC50
4400±n/a nM
Citation
 Asano, NNishida, MKato, AKizu, HMatsui, KShimada, YItoh, TBaba, MWatson, AANash, RJLilley, PMWatkin, DJFleet, GW Homonojirimycin isomers and N-alkylated homonojirimycins: structural and conformational basis of inhibition of glycosidases. J Med Chem 41:2565-71 (1998)  
Target
Name:
Tissue alpha-L-fucosidase
Synonyms:
Alpha-L-fucosidase I Fuca | Fuca1
Type:
PROTEIN
Mol. Mass.:
53482.81
Organism:
Rattus norvegicus
Description:
ChEMBL_990950
Residue:
462
  
Inhibitor
Name:
BDBM50408432
Synonyms:
CHEMBL2115215
Type:
Small organic molecule
Emp. Form.:
C7H15NO5
Mol. Mass.:
193.1977
SMILES:
OC[C@H]1N[C@@H](CO)[C@@H](O)[C@@H](O)[C@@H]1O
: