Target
Endothelin receptor type B
Ligand
BDBM50065510
Substrate
Meas. Tech.
ChEMBL_64042 (CHEMBL873580)
IC50
>10000±n/a nM
Citation
 Astles, PCBrealey, CBrown, TJFacchini, VHandscombe, CHarris, NVMcCarthy, CMcLay, IMPorter, BRoach, AGSargent, CSmith, CWalsh, RJ Selective endothelin A receptor antagonists. 3. Discovery and structure-activity relationships of a series of 4-phenoxybutanoic acid derivatives. J Med Chem 41:2732-44 (1998)  
Target
Name:
Endothelin receptor type B
Synonyms:
EDNRB_RAT ET-B Endothelin receptor | Endothelin receptor non-selective type
Type:
Enzyme Catalytic Domain
Mol. Mass.:
49483.43
Organism:
RAT
Description:
ENDOTHELIN B EDNRB RAT::P21451
Residue:
442
  
Inhibitor
Name:
BDBM50065510
Synonyms:
2-(3-Carboxy-1-o-tolyl-propoxy)-4-(thiophen-3-ylmethoxy)-benzoic acid | CHEMBL94279
Type:
Small organic molecule
Emp. Form.:
C23H22O6S
Mol. Mass.:
426.482
SMILES:
Cc1ccccc1C(CCC(O)=O)Oc1cc(OCc2ccsc2)ccc1C(O)=O
: