Target
Endothelin-1 receptor
Ligand
BDBM50065514
Substrate
Meas. Tech.
ChEMBL_63353 (CHEMBL679118)
IC50
110±n/a nM
Citation
 Astles, PCBrealey, CBrown, TJFacchini, VHandscombe, CHarris, NVMcCarthy, CMcLay, IMPorter, BRoach, AGSargent, CSmith, CWalsh, RJ Selective endothelin A receptor antagonists. 3. Discovery and structure-activity relationships of a series of 4-phenoxybutanoic acid derivatives. J Med Chem 41:2732-44 (1998)  
Target
Name:
Endothelin-1 receptor
Synonyms:
EDNRA_RAT Ednra Endothelin-1 receptor
Type:
Enzyme Catalytic Domain
Mol. Mass.:
48256.91
Organism:
RAT
Description:
ENDOTHELIN A EDNRA RAT::P26684
Residue:
426
  
Inhibitor
Name:
BDBM50065514
Synonyms:
5-Oxo-5-[3-(thiophen-3-ylmethoxy)-phenyl]-4-o-tolyl-pentanoic acid | CHEMBL421365
Type:
Small organic molecule
Emp. Form.:
C23H22O4S
Mol. Mass.:
394.483
SMILES:
Cc1ccccc1C(CCC(O)=O)C(=O)c1cccc(OCc2ccsc2)c1
: