Target
Endothelin receptor type B
Ligand
BDBM50065523
Substrate
Meas. Tech.
ChEMBL_64042 (CHEMBL873580)
IC50
10000±n/a nM
Citation
 Astles, PCBrealey, CBrown, TJFacchini, VHandscombe, CHarris, NVMcCarthy, CMcLay, IMPorter, BRoach, AGSargent, CSmith, CWalsh, RJ Selective endothelin A receptor antagonists. 3. Discovery and structure-activity relationships of a series of 4-phenoxybutanoic acid derivatives. J Med Chem 41:2732-44 (1998)  
Target
Name:
Endothelin receptor type B
Synonyms:
EDNRB_RAT ET-B Endothelin receptor | Endothelin receptor non-selective type
Type:
Enzyme Catalytic Domain
Mol. Mass.:
49483.43
Organism:
RAT
Description:
ENDOTHELIN B EDNRB RAT::P21451
Residue:
442
  
Inhibitor
Name:
BDBM50065523
Synonyms:
(R)-4-[2-Cyano-5-(isothiazol-4-ylmethoxy)-phenoxy]-4-o-tolyl-butyric acid | CHEMBL93331
Type:
Small organic molecule
Emp. Form.:
C22H20N2O4S
Mol. Mass.:
408.47
SMILES:
Cc1ccccc1[C@@H](CCC(O)=O)Oc1cc(OCc2cnsc2)ccc1C#N
: