Target
Endothelin receptor type B
Ligand
BDBM50065513
Substrate
Meas. Tech.
ChEMBL_64042 (CHEMBL873580)
IC50
10000±n/a nM
Citation
 Astles, PCBrealey, CBrown, TJFacchini, VHandscombe, CHarris, NVMcCarthy, CMcLay, IMPorter, BRoach, AGSargent, CSmith, CWalsh, RJ Selective endothelin A receptor antagonists. 3. Discovery and structure-activity relationships of a series of 4-phenoxybutanoic acid derivatives. J Med Chem 41:2732-44 (1998)  
Target
Name:
Endothelin receptor type B
Synonyms:
EDNRB_RAT ET-B Endothelin receptor | Endothelin receptor non-selective type
Type:
Enzyme Catalytic Domain
Mol. Mass.:
49483.43
Organism:
RAT
Description:
ENDOTHELIN B EDNRB RAT::P21451
Residue:
442
  
Inhibitor
Name:
BDBM50065513
Synonyms:
4-[2-Oxazol-2-yl-5-(thiophen-3-ylmethoxy)-phenoxy]-4-o-tolyl-butyric acid | CHEMBL96301
Type:
Small organic molecule
Emp. Form.:
C25H23NO5S
Mol. Mass.:
449.519
SMILES:
Cc1ccccc1C(CCC(O)=O)Oc1cc(OCc2ccsc2)ccc1-c1ncco1
: