Target
Endothelin-1 receptor
Ligand
BDBM50065517
Substrate
Meas. Tech.
ChEMBL_63353 (CHEMBL679118)
IC50
1000±n/a nM
Citation
 Astles, PCBrealey, CBrown, TJFacchini, VHandscombe, CHarris, NVMcCarthy, CMcLay, IMPorter, BRoach, AGSargent, CSmith, CWalsh, RJ Selective endothelin A receptor antagonists. 3. Discovery and structure-activity relationships of a series of 4-phenoxybutanoic acid derivatives. J Med Chem 41:2732-44 (1998)  
Target
Name:
Endothelin-1 receptor
Synonyms:
EDNRA_RAT Ednra Endothelin-1 receptor
Type:
Enzyme Catalytic Domain
Mol. Mass.:
48256.91
Organism:
RAT
Description:
ENDOTHELIN A EDNRA RAT::P26684
Residue:
426
  
Inhibitor
Name:
BDBM50065517
Synonyms:
5-(2,4-Bis-benzyloxy-phenyl)-1H-pyrazole-3-carboxylic acid | CHEMBL327247
Type:
Small organic molecule
Emp. Form.:
C24H20N2O4
Mol. Mass.:
400.4266
SMILES:
OC(=O)c1cc(n[nH]1)-c1ccc(OCc2ccccc2)cc1OCc1ccccc1
: