Target
Alpha-1B adrenergic receptor
Ligand
BDBM50040253
Substrate
Meas. Tech.
ChEMBL_34340 (CHEMBL649153)
Ki
1.1±n/a nM
Citation
 Chern, JWTao, PLWang, KCGutcait, ALiu, SWYen, MHChien, SLRong, JK Studies on quinazolines and 1,2,4-benzothiadiazine 1,1-dioxides. 8.1, 2 synthesis and pharmacological evaluation of tricyclic fused quinazolines and 1,2,4-benzothiadiazine 1,1-dioxides as potential alpha1-adrenoceptor antagonists. J Med Chem 41:3128-41 (1998)  
Target
Name:
Alpha-1B adrenergic receptor
Synonyms:
ADA1B_RAT Alpha 1B-adrenoceptor Alpha adrenergic receptor 1A and 1B Alpha-1Adrenoceptor Alpha-1B adrenoreceptor | adrenergic Alpha1B
Type:
G Protein-Coupled Receptor (GPCR)
Mol. Mass.:
56606.71
Organism:
Rattus norvegicus (rat)
Description:
Receptor binding assays were performed using rat cortical membranes.
Residue:
515
  
Inhibitor
Name:
BDBM50040253
Synonyms:
3-{2-[4-(2-Methoxy-phenyl)-piperazin-1-yl]-ethyl}-1H-quinazoline-2,4-dione | CHEMBL51433
Type:
Small organic molecule
Emp. Form.:
C21H24N4O3
Mol. Mass.:
380.4403
SMILES:
COc1ccccc1N1CCN(CCn2c(=O)[nH]c3ccccc3c2=O)CC1
: