Target
ATP-dependent translocase ABCB1
Ligand
BDBM50034682
Substrate
Meas. Tech.
ChEMBL_207616 (CHEMBL812204)
EC50
60±n/a nM
Citation
 Chiba, PHolzer, WLandau, MBechmann, GLorenz, KPlagens, BHitzler, MRichter, EEcker, G Substituted 4-acylpyrazoles and 4-acylpyrazolones: synthesis and multidrug resistance-modulating activity. J Med Chem 41:4001-11 (1998)  
Target
Name:
ATP-dependent translocase ABCB1
Synonyms:
ABCB1 MDR1_HUMAN Multidrug resistance protein 1 P-glycoprotein (P-gp) PGY1
Type:
Protein
Mol. Mass.:
141503.50
Organism:
Homo sapiens (Human)
Description:
P08183
Residue:
1280
  
Inhibitor
Name:
BDBM50034682
Synonyms:
(R)-2,6-Dimethyl-4-(3-nitro-phenyl)-1,4-dihydro-pyridine-3,5-dicarboxylic acid 3-[3-(4,4-diphenyl-piperidin-1-yl)-propyl] ester 5-methyl ester NIGULDIPINE
Type:
Small organic molecule
Emp. Form.:
C36H39N3O6
Mol. Mass.:
609.7114
SMILES:
COC(=[OH+])C1=C(C)N=C(C)C([C@@H]1c1cccc(c1)[N+]([O-])=O)=C([O-])OCCCN1CCC(CC1)(c1ccccc1)c1ccccc1
: