Target
B2 bradykinin receptor
Ligand
BDBM50067274
Substrate
Meas. Tech.
ChEMBL_40265 (CHEMBL656501)
IC50
0.55±n/a nM
Citation
 Abe, YKayakiri, HSatoh, SInoue, TSawada, YInamura, NAsano, MAramori, IHatori, CSawai, HOku, TTanaka, H A novel class of orally active non-peptide bradykinin B2 receptor antagonists. 3. Discovering bioisosteres of the imidazo[1,2-a] pyridine moiety. J Med Chem 41:4062-79 (1998)  
Target
Name:
B2 bradykinin receptor
Synonyms:
B2 BRADYKININ B2R BK-2 receptor BKRB2_HUMAN | Bradykinin B2 receptor
Type:
Enzyme Catalytic Domain
Mol. Mass.:
44467.17
Organism:
Homo sapiens (Human)
Description:
B2 BRADYKININ BDKRB2 HUMAN::P30411
Residue:
391
  
Inhibitor
Name:
BDBM50067274
Synonyms:
(E)-N-({[2,4-Dichloro-3-(2-methyl-quinolin-8-yloxymethyl)-phenyl]-methyl-carbamoyl}-methyl)-3-[4-(2-oxo-pyrrolidin-1-yl)-phenyl]-acrylamide; hydrochloride | CHEMBL553293
Type:
Small organic molecule
Emp. Form.:
C33H30Cl2N4O4
Mol. Mass.:
617.522
SMILES:
CN(C(=O)CNC(=O)\C=C\c1ccc(cc1)N1CCCC1=O)c1ccc(Cl)c(COc2cccc3ccc(C)nc23)c1Cl
: