Target
Cholinesterase
Ligand
BDBM50422270
Substrate
Meas. Tech.
ChEMBL_41559 (CHEMBL655896)
IC50
3715±n/a nM
Citation
 Melchiorre, CAndrisano, VBolognesi, MLBudriesi, RCavalli, ACavrini, VRosini, MTumiatti, VRecanatini, M Acetylcholinesterase noncovalent inhibitors based on a polyamine backbone for potential use against Alzheimer's disease. J Med Chem 41:4186-9 (1998)  
Target
Name:
Cholinesterase
Synonyms:
Acylcholine acylhydrolase Butyrylcholine esterase (BChE) Butyrylcholinesterase (BuChE) CHLE_HUMAN Cholinesterases Pseudocholinesterase
Type:
Homotetramer
Mol. Mass.:
68422.27
Organism:
Homo sapiens (Human)
Description:
P06276
Residue:
602
  
Inhibitor
Name:
BDBM50422270
Synonyms:
CHEMBL422977
Type:
Small organic molecule
Emp. Form.:
C35H60N4O2
Mol. Mass.:
568.8765
SMILES:
COc1ccccc1CNCCCCCCNCCCCCCCNCCCCCCNCc1ccccc1OC
: