Target
Acetylcholinesterase
Ligand
BDBM50422271
Substrate
Meas. Tech.
ChEMBL_28904 (CHEMBL638603)
IC50
7244±n/a nM
Citation
 Melchiorre, CAndrisano, VBolognesi, MLBudriesi, RCavalli, ACavrini, VRosini, MTumiatti, VRecanatini, M Acetylcholinesterase noncovalent inhibitors based on a polyamine backbone for potential use against Alzheimer's disease. J Med Chem 41:4186-9 (1998)  
Target
Name:
Acetylcholinesterase
Synonyms:
ACES_HUMAN Acetylcholinesterase (AChE) | Acetylcholinesterase (human AChE)
Type:
Enzyme
Mol. Mass.:
67792.70
Organism:
Homo sapiens (Human)
Description:
P22303
Residue:
614
  
Inhibitor
Name:
BDBM50422271
Synonyms:
CHEMBL134382
Type:
Small organic molecule
Emp. Form.:
C33H56N4O2
Mol. Mass.:
540.8233
SMILES:
COc1ccccc1CNCCCCCCNCCCCCNCCCCCCNCc1ccccc1OC
: