Target
Acetylcholinesterase
Ligand
BDBM50422270
Substrate
Meas. Tech.
ChEMBL_28904 (CHEMBL638603)
IC50
4467±n/a nM
Citation
 Melchiorre, CAndrisano, VBolognesi, MLBudriesi, RCavalli, ACavrini, VRosini, MTumiatti, VRecanatini, M Acetylcholinesterase noncovalent inhibitors based on a polyamine backbone for potential use against Alzheimer's disease. J Med Chem 41:4186-9 (1998)  
Target
Name:
Acetylcholinesterase
Synonyms:
ACES_HUMAN Acetylcholinesterase (AChE) | Acetylcholinesterase (human AChE)
Type:
Enzyme
Mol. Mass.:
67792.70
Organism:
Homo sapiens (Human)
Description:
P22303
Residue:
614
  
Inhibitor
Name:
BDBM50422270
Synonyms:
CHEMBL422977
Type:
Small organic molecule
Emp. Form.:
C35H60N4O2
Mol. Mass.:
568.8765
SMILES:
COc1ccccc1CNCCCCCCNCCCCCCCNCCCCCCNCc1ccccc1OC
: