Target
Choline O-acetyltransferase
Ligand
BDBM8961
Substrate
Meas. Tech.
ChEMBL_27380 (CHEMBL642413)
Ki
0.15±n/a nM
Citation
 Melchiorre, CAndrisano, VBolognesi, MLBudriesi, RCavalli, ACavrini, VRosini, MTumiatti, VRecanatini, M Acetylcholinesterase noncovalent inhibitors based on a polyamine backbone for potential use against Alzheimer's disease. J Med Chem 41:4186-9 (1998)  
Target
Name:
Choline O-acetyltransferase
Synonyms:
CLAT_RAT Choline Acetyltransferase Choline acetylase
Type:
Enzyme Catalytic Domain
Mol. Mass.:
71875.58
Organism:
RAT
Description:
Choline Acetyltransferase 0 RAT::P32738
Residue:
640
  
Inhibitor
Name:
BDBM8961
Synonyms:
1,2,3,4-tetrahydro-9-acridinamine 9-THA CHEMBL1337960 Cognex Tracine cid_1935 | tacrine.HCl
Type:
Small organic molecule
Emp. Form.:
C13H14N2
Mol. Mass.:
198.2637
SMILES:
Nc1c2CCCCc2nc2ccccc12
: