Target
Somatostatin receptor type 2
Ligand
BDBM50272772
Substrate
Meas. Tech.
ChEMBL_200367 (CHEMBL805715)
Ki
0.30±n/a nM
Citation
 Liu, STang, CHo, BAnkersen, MStidsen, CECrider, AM Nonpeptide somatostatin agonists with sst4 selectivity: synthesis and structure-activity relationships of thioureas. J Med Chem 41:4693-705 (1998)  
Target
Name:
Somatostatin receptor type 2
Synonyms:
SOMATOSTATIN SST2 SS-2-R SS2R SSTR2 | Somatostatin receptor type 2 (SSTR2)
Type:
Enzyme
Mol. Mass.:
41344.94
Organism:
Homo sapiens (Human)
Description:
P30874
Residue:
369
  
Inhibitor
Name:
BDBM50272772
Synonyms:
10-(4-Amino-butyl)-19-(2-amino-3-phenyl-propionylamino)-16-benzyl-7-(1-hydroxy-ethyl)-13-(1H-indol-3-ylmethyl)-6,9,12,15,18-pentaoxo-1,2-dithia-5,8,11,14,17-pentaaza-cycloicosane-4-carboxylic acid (2-hydroxy-1- 2-{[(13R,16S,19R)-10-(4-Amino-butyl)-19-((S)-2-amino-3-phenyl-propionylamino)-16-benzyl-7-(1-hydroxy-ethyl)-13-(1H-indol-3-ylmethyl)-6,9,12,15,18-pentaoxo-1,2-dithia-5,8,11,14,17-pentaaza-cycloicosane-4-carbonyl]-amino}-3-hydroxy-butyric acid OCTREOTIDE
Type:
Small organic molecule
Emp. Form.:
C49H66N10O10S2
Mol. Mass.:
1019.239
SMILES:
C[C@@H](O)[C@@H](CO)NC(=O)[C@@H]1CSSC[C@H](NC(=O)[C@H](N)Cc2ccccc2)C(=O)N[C@@H](Cc2ccccc2)C(=O)N[C@H](Cc2c[nH]c3ccccc23)C(=O)N[C@@H](CCCCN)C(=O)N[C@@H]([C@@H](C)O)C(=O)N1
: