Target
Glyceraldehyde-3-phosphate dehydrogenase
Ligand
BDBM50068147
Substrate
Meas. Tech.
ChEMBL_72900 (CHEMBL684215)
IC50
>270000±n/a nM
Citation
 Aronov, AMVerlinde, CLHol, WGGelb, MH Selective tight binding inhibitors of trypanosomal glyceraldehyde-3-phosphate dehydrogenase via structure-based drug design. J Med Chem 41:4790-9 (1998)  
Target
Name:
Glyceraldehyde-3-phosphate dehydrogenase
Synonyms:
G3P_HUMAN GAPDH glyceraldehyde-3-phosphate dehydrogenase
Type:
PROTEIN
Mol. Mass.:
36060.86
Organism:
Homo sapiens (Human)
Description:
ChEMBL_1511315
Residue:
335
  
Inhibitor
Name:
BDBM50068147
Synonyms:
CHEMBL356360 | N-{4-Hydroxy-5-hydroxymethyl-2-[6-(2-methyl-benzylamino)-purin-9-yl]-tetrahydro-furan-3-yl}-3-methoxy-benzamide
Type:
Small organic molecule
Emp. Form.:
C26H28N6O5
Mol. Mass.:
504.5377
SMILES:
COc1cccc(c1)C(=O)NC1C(O)C(CO)OC1n1cnc2c(NCc3ccccc3C)ncnc12
: