Target
Glyceraldehyde-3-phosphate dehydrogenase
Ligand
BDBM50068143
Substrate
Meas. Tech.
ChEMBL_72770 (CHEMBL681383)
IC50
650000±n/a nM
Citation
 Aronov, AMVerlinde, CLHol, WGGelb, MH Selective tight binding inhibitors of trypanosomal glyceraldehyde-3-phosphate dehydrogenase via structure-based drug design. J Med Chem 41:4790-9 (1998)  
Target
Name:
Glyceraldehyde-3-phosphate dehydrogenase
Synonyms:
G3P_HUMAN GAPDH glyceraldehyde-3-phosphate dehydrogenase
Type:
PROTEIN
Mol. Mass.:
36060.86
Organism:
Homo sapiens (Human)
Description:
ChEMBL_1511315
Residue:
335
  
Inhibitor
Name:
BDBM50068143
Synonyms:
CHEMBL145324 | N-[2-(6-Amino-purin-9-yl)-4-hydroxy-5-hydroxymethyl-tetrahydro-furan-3-yl]-3,5-dihydroxy-benzamide
Type:
Small organic molecule
Emp. Form.:
C17H18N6O6
Mol. Mass.:
402.3614
SMILES:
Nc1ncnc2n(cnc12)C1OC(CO)C(O)C1NC(=O)c1cc(O)cc(O)c1
: