Target
Sodium-dependent serotonin transporter
Ligand
BDBM22396
Substrate
Meas. Tech.
ChEMBL_201834 (CHEMBL805341)
Ki
135±n/a nM
Citation
 Kozikowski, APAraldi, GLPrakash, KRZhang, MJohnson, KM Synthesis and biological properties of new 2beta-alkyl- and 2beta-aryl-3-(substituted phenyl)tropane derivatives: stereochemical effect of C-3 on affinity and selectivity for neuronal dopamine and serotonin transporters. J Med Chem 41:4973-82 (1999)  
Target
Name:
Sodium-dependent serotonin transporter
Synonyms:
5-HT Transporter 5HT transporter Anandamid membrane transporter, AMT Monoamine transporters; Norepinephrine & serotonin Slc6a4 Sodium-dependent serotonin transporter (SERT) | imipramine receptor
Type:
Multi-pass membrane protein
Mol. Mass.:
70168.43
Organism:
Rattus norvegicus (rat)
Description:
P31652
Residue:
630
  
Inhibitor
Name:
BDBM22396
Synonyms:
(1R,2S,3S,5S)-3-(4-chlorophenyl)-2-[5-(4-fluorophenyl)-1,3-thiazol-2-yl]-8-methyl-8-azabicyclo[3.2.1]octane WIN35,065-2 methyl (1R,2S,3S,5S)-8-methyl-3-phenyl-8-azabicyclo[3.2.1]octane-2-carboxylate | troparil, 1R-(exo,exo)-isomer
Type:
Small organic molecule
Emp. Form.:
C16H21NO2
Mol. Mass.:
259.3434
SMILES:
COC(=O)[C@@H]1[C@H]2CC[C@@H](C[C@@H]1c1ccccc1)N2C
: