Target
Mu-type opioid receptor
Ligand
BDBM50068657
Substrate
Meas. Tech.
ChEMBL_148851 (CHEMBL756647)
Ki
2.91±n/a nM
Citation
 Tourwé, DMannekens, EDiem, TNVerheyden, PJaspers, HTóth, GPéter, AKertész, ITörök, GChung, NNSchiller, PW Side chain methyl substitution in the delta-opioid receptor antagonist TIPP has an important effect on the activity profile. J Med Chem 41:5167-76 (1999)  
Target
Name:
Mu-type opioid receptor
Synonyms:
MOR-1 Mu-type opioid receptor (MOR) OPRM_RAT Opioid receptor B Ror-b
Type:
G Protein-Coupled Receptor (GPCR)
Mol. Mass.:
44503.11
Organism:
Rattus norvegicus (rat)
Description:
Competition binding assays were carried out using membrane preparations from transfected HN9.10 cells that constitutively expressed the mu opioid receptor.
Residue:
398
  
Inhibitor
Name:
BDBM50068657
Synonyms:
2-[2-Amino-3-(4-hydroxy-phenyl)-propionyl]-1,2,3,4-tetrahydro-isoquinoline-3-carboxylic acid [(1S,2R)-1-(1-carbamoyl-2-phenyl-ethylcarbamoyl)-2-phenyl-propyl]-amide | CHEMBL2371016
Type:
Small organic molecule
Emp. Form.:
C38H41N5O5
Mol. Mass.:
647.7626
SMILES:
C[C@H]([C@H](NC(=O)[C@@H]1Cc2ccccc2CN1C(=O)[C@@H](N)Cc1ccc(O)cc1)C(=O)N[C@@H](Cc1ccccc1)C(N)=O)c1ccccc1
: