Target
Endothelin-1 receptor
Ligand
BDBM50068685
Substrate
Meas. Tech.
ChEMBL_63369 (CHEMBL676105)
Ki
13±n/a nM
Citation
 Murugesan, NGu, ZStein, PDBisaha, SSpergel, SGirotra, RLee, VGLloyd, JMisra, RNSchmidt, JMathur, AStratton, LKelly, YFBird, EWaldron, TLiu, ECZhang, RLee, HSerafino, RAbboa-Offei, BMathers, PGiancarli, MSeymour, AAWebb, MLHunt, JT Biphenylsulfonamide endothelin antagonists: structure-activity relationships of a series of mono- and disubstituted analogues and pharmacology of the orally active endothelin antagonist 2'-amino-N- (3,4-dimethyl-5-isoxazolyl)-4'-(2-methylpropyl)[1, 1'-biphenyl]-2-sulfonamide (BMS-187308). J Med Chem 41:5198-218 (1999)  
Target
Name:
Endothelin-1 receptor
Synonyms:
EDNRA_RAT Ednra Endothelin-1 receptor
Type:
Enzyme Catalytic Domain
Mol. Mass.:
48256.91
Organism:
RAT
Description:
ENDOTHELIN A EDNRA RAT::P26684
Residue:
426
  
Inhibitor
Name:
BDBM50068685
Synonyms:
4'-Isobutyl-biphenyl-2-sulfonic acid (4,5-dimethyl-isoxazol-3-yl)-amide | CHEMBL434082
Type:
Small organic molecule
Emp. Form.:
C21H24N2O3S
Mol. Mass.:
384.492
SMILES:
CC(C)Cc1ccc(cc1)-c1ccccc1S(=O)(=O)Nc1noc(C)c1C
: