Target
Prothrombin
Ligand
BDBM50454822
Substrate
Meas. Tech.
ChEMBL_208889 (CHEMBL814946)
Ki
0.090000±n/a nM
Citation
 Brady, SFStauffer, KJLumma, WCSmith, GMRamjit, HGLewis, SDLucas, BJGardell, SJLyle, EAAppleby, SDCook, JJHolahan, MAStranieri, MTLynch, JJLin, JHChen, IWVastag, KNaylor-Olsen, AMVacca, JP Discovery and development of the novel potent orally active thrombin inhibitor N-(9-hydroxy-9-fluorenecarboxy)prolyl trans-4-aminocyclohexylmethyl amide (L-372,460): coapplication of structure-based design and rapid multiple analogue synthesis on solid support. J Med Chem 41:401-6 (1998)  
Target
Name:
Prothrombin
Synonyms:
Activation peptide fragment 1 Coagulation factor II Prothrombin precursor Thrombin heavy chain | Thrombin light chain
Type:
Protein
Mol. Mass.:
70029.57
Organism:
Homo sapiens (Human)
Description:
P00734
Residue:
622
  
Inhibitor
Name:
BDBM50454822
Synonyms:
CHEMBL2062141 | L-370518
Type:
Small organic molecule
Emp. Form.:
C25H37N5O4
Mol. Mass.:
471.5924
SMILES:
[H][C@@](NC(=O)[C@@H]1CCCN1C(=O)[C@@H](Cc1ccccc1)NC)(C(=O)C(=O)NC)[C@@]1([H])CC[C@H](N)CC1
: