Target
Acetylcholine receptor subunit alpha
Ligand
BDBM50049753
Substrate
Meas. Tech.
ChEMBL_216981 (CHEMBL822798)
Ki
384±n/a nM
Citation
 Holladay, MWWasicak, JTLin, NHHe, YRyther, KBBannon, AWBuckley, MJKim, DJDecker, MWAnderson, DJCampbell, JEKuntzweiler, TADonnelly-Roberts, DLPiattoni-Kaplan, MBriggs, CAWilliams, MArneric, SP Identification and initial structure-activity relationships of (R)-5-(2-azetidinylmethoxy)-2-chloropyridine (ABT-594), a potent, orally active, non-opiate analgesic agent acting via neuronal nicotinic acetylcholine receptors. J Med Chem 41:407-12 (1998)  
Target
Name:
Acetylcholine receptor subunit alpha
Synonyms:
ACHA_TETCF Acetylcholine receptor protein alpha chain | CHRNA1
Type:
PROTEIN
Mol. Mass.:
52735.09
Organism:
Torpedo californica
Description:
ChEMBL_216981
Residue:
461
  
Inhibitor
Name:
BDBM50049753
Synonyms:
3-((R)-1-Azetidin-2-ylmethoxy)-pyridine 3-((S)-Azetidin-2-yloxy)-pyridine A-85380 | CHEMBL262769
Type:
Small organic molecule
Emp. Form.:
C9H12N2O
Mol. Mass.:
164.2044
SMILES:
C(Oc1cccnc1)[C@H]1CCN1
: