Target
Androgen receptor
Ligand
BDBM50063121
Substrate
Meas. Tech.
ChEMBL_36279 (CHEMBL651953)
Ki
81±n/a nM
Citation
 Hamann, LGHiguchi, RIZhi, LEdwards, JPWang, XNMarschke, KBKong, JWFarmer, LJJones, TK Synthesis and biological activity of a novel series of nonsteroidal, peripherally selective androgen receptor antagonists derived from 1,2-dihydropyridono[5,6-g]quinolines. J Med Chem 41:623-39 (1998)  
Target
Name:
Androgen receptor
Synonyms:
ANDR_HUMAN Androgen Receptor Androgen receptor/Baculoviral IAP repeat-containing protein 2 Dihydrotestosterone receptor Nuclear receptor subfamily 3 group C member 4
Type:
Receptor
Mol. Mass.:
99185.27
Organism:
Homo sapiens (Human)
Description:
CHO cells were stably transfected with human AR gene.
Residue:
920
  
Inhibitor
Name:
BDBM50063121
Synonyms:
1,6,8,8-Tetramethyl-4-trifluoromethyl-8,9-dihydro-1H-pyrido[3,2-g]quinolin-2-one | CHEMBL160386
Type:
Small organic molecule
Emp. Form.:
C17H17F3N2O
Mol. Mass.:
322.3249
SMILES:
CC1=CC(C)(C)Nc2cc3n(C)c(=O)cc(c3cc12)C(F)(F)F
: