Target
Androgen receptor
Ligand
BDBM50063116
Substrate
Meas. Tech.
ChEMBL_36279 (CHEMBL651953)
Ki
40±n/a nM
Citation
 Hamann, LGHiguchi, RIZhi, LEdwards, JPWang, XNMarschke, KBKong, JWFarmer, LJJones, TK Synthesis and biological activity of a novel series of nonsteroidal, peripherally selective androgen receptor antagonists derived from 1,2-dihydropyridono[5,6-g]quinolines. J Med Chem 41:623-39 (1998)  
Target
Name:
Androgen receptor
Synonyms:
ANDR_HUMAN Androgen Receptor Androgen receptor/Baculoviral IAP repeat-containing protein 2 Dihydrotestosterone receptor Nuclear receptor subfamily 3 group C member 4
Type:
Receptor
Mol. Mass.:
99185.27
Organism:
Homo sapiens (Human)
Description:
CHO cells were stably transfected with human AR gene.
Residue:
920
  
Inhibitor
Name:
BDBM50063116
Synonyms:
1,6,8,8,10-Pentamethyl-4-trifluoromethyl-6,7,8,9-tetrahydro-1H-pyrido[3,2-g]quinolin-2-one | CHEMBL352002
Type:
Small organic molecule
Emp. Form.:
C18H21F3N2O
Mol. Mass.:
338.3673
SMILES:
CC1CC(C)(C)Nc2c(C)c3n(C)c(=O)cc(c3cc12)C(F)(F)F
: