Target
Somatostatin receptor type 3
Ligand
BDBM50455453
Substrate
Meas. Tech.
ChEMBL_200502 (CHEMBL803847)
IC50
1000±n/a nM
Citation
 Hocart, SJJain, RMurphy, WATaylor, JEMorgan, BCoy, DH Potent antagonists of somatostatin: synthesis and biology. J Med Chem 41:1146-54 (1998)  
Target
Name:
Somatostatin receptor type 3
Synonyms:
SOMATOSTATIN SST3 SS3-R SSR-28 SSTR3 | Somatostatin receptor type 3 (SSTR3)
Type:
Protein
Mol. Mass.:
45855.97
Organism:
Homo sapiens (Human)
Description:
P32745
Residue:
418
  
Inhibitor
Name:
BDBM50455453
Synonyms:
CHEMBL2079558
Type:
Small organic molecule
Emp. Form.:
C63H73N11O9S2
Mol. Mass.:
1192.452
SMILES:
CC(C)[C@@H]1NC(=O)[C@H](CCCCN)NC(=O)[C@@H](Cc2c[nH]c3ccccc23)NC(=O)[C@H](Cc2ccc(O)cc2)NC(=O)[C@H](CSSC[C@@H](NC1=O)C(=O)N[C@@H](Cc1ccc2ccccc2c1)C(N)=O)NC(=O)[C@H](N)Cc1ccc2ccccc2c1
: