Target
Somatostatin receptor type 4
Ligand
BDBM50455455
Substrate
Meas. Tech.
ChEMBL_200511 (CHEMBL803855)
IC50
1000±n/a nM
Citation
 Hocart, SJJain, RMurphy, WATaylor, JEMorgan, BCoy, DH Potent antagonists of somatostatin: synthesis and biology. J Med Chem 41:1146-54 (1998)  
Target
Name:
Somatostatin receptor type 4
Synonyms:
SOMATOSTATIN SST4 SS4-R SSR4_HUMAN SSTR4 | Somatostatin receptor type 4 (SSTR4)
Type:
Enzyme
Mol. Mass.:
42015.38
Organism:
Homo sapiens (Human)
Description:
P31391
Residue:
388
  
Inhibitor
Name:
BDBM50455455
Synonyms:
CHEMBL2311181
Type:
Small organic molecule
Emp. Form.:
C63H73N11O9S2
Mol. Mass.:
1192.452
SMILES:
CC(C)[C@@H]1NC(=O)[C@H](CCCCN)NC(=O)[C@@H](Cc2c[nH]c3ccccc23)NC(=O)[C@H](Cc2ccc(O)cc2)NC(=O)[C@H](CSSC[C@@H](NC1=O)C(=O)N[C@@H](Cc1ccc2ccccc2c1)C(N)=O)NC(=O)[C@@H](N)Cc1ccc2ccccc2c1
: