Target
Somatostatin receptor type 1
Ligand
BDBM50455455
Substrate
Meas. Tech.
ChEMBL_200355 (CHEMBL807422)
IC50
2003±n/a nM
Citation
 Hocart, SJJain, RMurphy, WATaylor, JEMorgan, BCoy, DH Potent antagonists of somatostatin: synthesis and biology. J Med Chem 41:1146-54 (1998)  
Target
Name:
Somatostatin receptor type 1
Synonyms:
SOMATOSTATIN SST1 SS-1-R SS1R SSTR1 | Somatostatin receptor type 1 (SSTR1)
Type:
Enzyme
Mol. Mass.:
42692.81
Organism:
Homo sapiens (Human)
Description:
P30872
Residue:
391
  
Inhibitor
Name:
BDBM50455455
Synonyms:
CHEMBL2311181
Type:
Small organic molecule
Emp. Form.:
C63H73N11O9S2
Mol. Mass.:
1192.452
SMILES:
CC(C)[C@@H]1NC(=O)[C@H](CCCCN)NC(=O)[C@@H](Cc2c[nH]c3ccccc23)NC(=O)[C@H](Cc2ccc(O)cc2)NC(=O)[C@H](CSSC[C@@H](NC1=O)C(=O)N[C@@H](Cc1ccc2ccccc2c1)C(N)=O)NC(=O)[C@@H](N)Cc1ccc2ccccc2c1
: