Target
Muscarinic acetylcholine receptor M2
Ligand
BDBM50004656
Substrate
Meas. Tech.
ChEMBL_140046 (CHEMBL745721)
IC50
34±n/a nM
Citation
 Jeppesen, LOlesen, PHHansen, LSheardown, MJThomsen, CRasmussen, TJensen, AFChristensen, MSRimvall, KWard, JSWhitesitt, CCalligaro, DOBymaster, FPDelapp, NWFelder, CCShannon, HESauerberg, P 1-(1,2,5-Thiadiazol-4-yl)-4-azatricyclo[2.2.1.0(2,6)]heptanes as new potent muscarinic M1 agonists: structure-activity relationship for 3-aryl-2-propyn-1-yloxy and 3-aryl-2-propyn-1-ylthio derivatives. J Med Chem 42:1999-2006 (1999)  
Target
Name:
Muscarinic acetylcholine receptor M2
Synonyms:
ACM2_RAT Chrm-2 | Chrm2
Type:
Enzyme Catalytic Domain
Mol. Mass.:
51555.53
Organism:
RAT
Description:
P10980
Residue:
466
  
Inhibitor
Name:
BDBM50004656
Synonyms:
(2-Carbamoyloxy-ethyl)-trimethyl-ammonium (2-Hydroxyethyl)trimethyl ammonium chloride carbamate (carbachol)(2-Carbamoyloxy-ethyl)-trimethyl-ammonium 2-((Aminocarbonyl)oxy)-N,N,N-trimethylethanaminum chloride 2-(carbamoyloxy)-N,N,N-trimethylethanaminium chloride CARBASTAT Carbachol chloride Choline carbamate chloride Choline chlorine carbamate Karbamoylcholin chlorid | MIOSTAT
Type:
Small organic molecule
Emp. Form.:
C6H15N2O2
Mol. Mass.:
147.195
SMILES:
C[N+](C)(C)CCOC(N)=O
: