Target
Muscarinic acetylcholine receptor M1
Ligand
BDBM50003359
Substrate
Meas. Tech.
ChEMBL_138551 (CHEMBL746418)
EC50
135±n/a nM
Citation
 Jeppesen, LOlesen, PHHansen, LSheardown, MJThomsen, CRasmussen, TJensen, AFChristensen, MSRimvall, KWard, JSWhitesitt, CCalligaro, DOBymaster, FPDelapp, NWFelder, CCShannon, HESauerberg, P 1-(1,2,5-Thiadiazol-4-yl)-4-azatricyclo[2.2.1.0(2,6)]heptanes as new potent muscarinic M1 agonists: structure-activity relationship for 3-aryl-2-propyn-1-yloxy and 3-aryl-2-propyn-1-ylthio derivatives. J Med Chem 42:1999-2006 (1999)  
Target
Name:
Muscarinic acetylcholine receptor M1
Synonyms:
ACM1_HUMAN Cholinergic receptor, muscarinic 1 | Cholinergic, muscarinic M1
Type:
Protein
Mol. Mass.:
51442.54
Organism:
Homo sapiens (Human)
Description:
P11229
Residue:
460
  
Inhibitor
Name:
BDBM50003359
Synonyms:
5-(4-Hexyloxy-[1,2,5]thiadiazol-3-yl)-1-methyl-1,2,3,6-tetrahydro-pyridine; oxalic acid CHEMBL21536 LY 246708 | Xanomeline
Type:
Small organic molecule
Emp. Form.:
C14H23N3OS
Mol. Mass.:
281.417
SMILES:
CCCCCCOc1nsnc1C1=CCCN(C)C1
: