Target
Carbonic anhydrase 1
Ligand
BDBM50079031
Substrate
Meas. Tech.
ChEMBL_47513 (CHEMBL657823)
Ki
12±n/a nM
Citation
 Scozzafava, AMenabuoni, LMincione, FBriganti, FMincione, GSupuran, CT Carbonic anhydrase inhibitors. Synthesis of water-soluble, topically effective, intraocular pressure-lowering aromatic/heterocyclic sulfonamides containing cationic or anionic moieties: is the tail more important than the ring? J Med Chem 42:2641-50 (1999)  
Target
Name:
Carbonic anhydrase 1
Synonyms:
CA-I CAB Carbonate dehydratase I Carbonic anhydrase 1 (CA I) Carbonic anhydrase 1 (Recombinant CA I) Carbonic anhydrase B Carbonic anhydrase I (CA I) Carbonic anhydrase I (CAI) Carbonic anhydrase isoenzyme I (hCA I) | hCA
Type:
Enzyme
Mol. Mass.:
28873.37
Organism:
Homo sapiens (Human)
Description:
P00915
Residue:
261
  
Inhibitor
Name:
BDBM50079031
Synonyms:
6-(5,7-Dioxo-5,7-dihydro-pyrrolo[3,4-b]pyridin-6-yl)-benzothiazole-2-sulfonic acid amide | CHEMBL420610
Type:
Small organic molecule
Emp. Form.:
C14H8N4O4S2
Mol. Mass.:
360.368
SMILES:
NS(=O)(=O)c1nc2ccc(cc2s1)N1C(=O)c2cccnc2C1=O
: