Target
Carbonic anhydrase 1
Ligand
BDBM50079040
Substrate
Meas. Tech.
ChEMBL_47514 (CHEMBL657824)
Ki
19±n/a nM
Citation
 Scozzafava, AMenabuoni, LMincione, FBriganti, FMincione, GSupuran, CT Carbonic anhydrase inhibitors. Synthesis of water-soluble, topically effective, intraocular pressure-lowering aromatic/heterocyclic sulfonamides containing cationic or anionic moieties: is the tail more important than the ring? J Med Chem 42:2641-50 (1999)  
Target
Name:
Carbonic anhydrase 1
Synonyms:
CA-I CAB Carbonate dehydratase I Carbonic anhydrase 1 (CA I) Carbonic anhydrase 1 (Recombinant CA I) Carbonic anhydrase B Carbonic anhydrase I (CA I) Carbonic anhydrase I (CAI) Carbonic anhydrase isoenzyme I (hCA I) | hCA
Type:
Enzyme
Mol. Mass.:
28873.37
Organism:
Homo sapiens (Human)
Description:
P00915
Residue:
261
  
Inhibitor
Name:
BDBM50079040
Synonyms:
6-[2-(5-Sulfamoyl-[1,3,4]thiadiazol-2-ylcarbamoyl)-ethylcarbamoyl]-pyridine-2-carboxylic acid | CHEMBL316037
Type:
Small organic molecule
Emp. Form.:
C12H12N6O6S2
Mol. Mass.:
400.39
SMILES:
NS(=O)(=O)c1nnc(NC(=O)CCNC(=O)c2cccc(n2)C(O)=O)s1
: