Target
Carbonic anhydrase 2
Ligand
BDBM50079044
Substrate
Meas. Tech.
ChEMBL_45078 (CHEMBL657149)
Ki
20±n/a nM
Citation
 Scozzafava, AMenabuoni, LMincione, FBriganti, FMincione, GSupuran, CT Carbonic anhydrase inhibitors. Synthesis of water-soluble, topically effective, intraocular pressure-lowering aromatic/heterocyclic sulfonamides containing cationic or anionic moieties: is the tail more important than the ring? J Med Chem 42:2641-50 (1999)  
Target
Name:
Carbonic anhydrase 2
Synonyms:
CA-II CAC Carbonate dehydratase II Carbonic anhydrase 2 (CA-II) Carbonic anhydrase C Carbonic anhydrase II (CA-II) Carbonic anhydrase II (hCA II) | Carbonic anhydrase isoenzyme II (hCA II)
Type:
Enzyme
Mol. Mass.:
29250.71
Organism:
Homo sapiens (Human)
Description:
P00918
Residue:
260
  
Inhibitor
Name:
BDBM50079044
Synonyms:
6-(4-Sulfamoyl-benzyloxycarbamoyl)-pyridine-2-carboxylic acid | CHEMBL280071
Type:
Small organic molecule
Emp. Form.:
C14H13N3O6S
Mol. Mass.:
351.335
SMILES:
NS(=O)(=O)c1ccc(CONC(=O)c2cccc(n2)C(O)=O)cc1
: